{"text_format":"1","workbook":"xlsx","n_sheets":7,"sheets":["①表紙  ","②納税カレンダー","③記入様式","④印刷後の手引き","記入例","取扱金融機関","納税課用・修正シート"],"not_rendered":{"charts":0,"images":9,"macros":1,"external_links":0,"defined_names":29,"comments":0,"pivot_tables":0},"unopened":[],"bounds":{"document_bytes":16777216,"sheet_cells":100000,"rows_first":2000,"rows_last":500,"rows_between":2000,"halvings":0,"cell_chars":16384,"cell_head_chars":4096},"cells_cut":0,"cells_raw":0,"read":"whole","date_system":"1900"}

{"sheet":"①表紙  ","index":0,"n_rows":116,"n_cols":63,"rows_kept":116,"cut":false,"hidden":false,"merged":[[55,46,57,61],[49,3,54,32],[49,46,51,61],[49,62,51,66],[52,46,54,61],[52,62,54,66],[43,46,45,61],[43,62,45,66],[44,2,47,12],[46,46,48,61],[46,62,48,66],[58,62,60,66],[70,62,72,66],[101,2,111,29],[102,35,111,66],[115,2,145,33],[115,35,145,66],[77,2,80,12],[0,0,2,68],[3,0,3,68],[4,0,12,68],[73,62,75,66],[40,62,42,66],[21,0,21,68],[24,1,30,67],[32,2,35,12],[32,24,35,34],[32,46,35,56],[37,3,42,22],[37,25,39,44],[37,46,39,61],[37,62,39,66],[40,25,42,44],[55,62,57,66],[40,46,42,61],[79,72,82,77],[82,2,92,33],[82,35,100,66],[94,2,99,33],[61,3,75,44],[61,46,63,61],[61,62,63,66],[64,46,66,61],[64,62,66,66],[67,46,69,61],[67,62,69,66],[70,46,72,61],[73,46,75,61],[56,5,59,43],[58,46,60,61]]}
["たつの市市税等口座振替依頼書兼解約届書"]
[]
[]
["本書をご確認のうえ、ページ下部の矢印「→」から、次のページにお進みください。"]
[]
[]
[]
[]
[]
[]
[]
[]
[]
[]
[]
{"$rows_left_out":102}
{"sheet":"②納税カレンダー","index":1,"n_rows":27,"n_cols":18,"rows_kept":27,"cut":false,"hidden":false,"merged":[[5,9,6,9],[5,10,6,11],[5,12,6,13],[5,14,6,15],[5,16,6,17],[19,0,21,7],[5,4,6,4],[5,5,6,5],[2,6,2,7],[0,0,0,7],[5,6,5,7],[3,0,3,7],[5,1,6,1],[5,2,6,2],[5,3,6,3],[1,0,1,7]]}
[{"$f":"\"令和\"&DBCS(納税課用・修正シート!D4&\"年度たつの市納税カレンダー\")","v":"令和６年度たつの市納税カレンダー"}]
["申込受付締切をご確認のうえ、矢印「→」から、次のページにお進みください。"]
[null,null,null,null,null,null,{"$f":"TODAY()","v":"2024-03-12"}]
[]
[null,null,null,null,null,null,null,null,null,"期ごとの一覧"]
[null,"納  期  限\n(口座振替日)","市民税・県民税\n・森林環境税\n(普通徴収分)","固定資産税\n都市計画税","軽自動車税\n（種別割）","国民健康保険税\n（普通徴収分）","申込受付締切",null,null,null,"市・県民税\n(普通徴収分)",null,"固定資産税\n都市計画税",null,"軽自動車税",null,"国民健康保険税\n（普通徴収分）"]
[null,null,null,null,null,null,"新規・変更","解約"]
["４月",{"$f":"納税課用・修正シート!I6","v":"2024-04-30"},{"$f":"DBCS(IF(納税課用・修正シート!E6=\"\",\"\",納税課用・修正シート!E6))","v":""},{"$f":"DBCS(IF(納税課用・修正シート!F6=\"\",\"\",納税課用・修正シート!F6))","v":""},{"$f":"DBCS(IF(納税課用・修正シート!G6=\"\",\"\",納税課用・修正シート!G6))","v":"全期"},{"$f":"DBCS(IF(納税課用・修正シート!H6=\"\",\"\",納税課用・修正シート!H6))","v":""},{"$f":"IF(納税課用・修正シート!J6>=$G$3,納税課用・修正シート!J6,③記入様式!$AR$74)","v":"2024-03-29"},{"$f":"IF(納税課用・修正シート!K6>=$G$3,納税課用・修正シート!K6,③記入様式!$AR$74)","v":"2024-04-17"},null,"期","新規・変更","解約・廃止","新規・変更","解約・廃止","新規・変更","解約・廃止","新規・変更","解約・廃止"]
["５月",{"$f":"納税課用・修正シート!I7","v":"2024-05-31"},{"$f":"DBCS(IF(納税課用・修正シート!E7=\"\",\"\",納税課用・修正シート!E7))","v":""},{"$f":"DBCS(IF(納税課用・修正シート!F7=\"\",\"\",納税課用・修正シート!F7))","v":"全期\n（第１期）"},{"$f":"DBCS(IF(納税課用・修正シート!G7=\"\",\"\",納税課用・修正シート!G7))","v":""},{"$f":"DBCS(IF(納税課用・修正シート!H7=\"\",\"\",納税課用・修正シート!H7))","v":""},{"$f":"IF(納税課用・修正シート!J7>=$G$3,納税課用・修正シート!J7,③記入様式!$AR$74)","v":"2024-04-30"},{"$f":"IF(納税課用・修正シート!K7>=$G$3,納税課用・修正シート!K7,③記入様式!$AR$74)","v":"2024-05-21"},null,"第１期",{"$f":"VLOOKUP($K$17,$C$8:$H$18,5,FALSE)","v":"2024-05-31"},{"$f":"VLOOKUP($K$17,$C$8:$H$18,6,FALSE)","v":"2024-06-19"},{"$f":"VLOOKUP($K$17,$D$8:$H$18,4,FALSE)","v":"2024-04-30"},{"$f":"VLOOKUP($K$17,$D$8:$H$18,5,FALSE)","v":"2024-05-21"},{"$f":"VLOOKUP($L$17,$E$8:$H$18,3,FALSE)","v":"2024-03-29"},{"$f":"VLOOKUP($L$17,$E$8:$H$18,4,FALSE)","v":"2024-04-17"},{"$f":"VLOOKUP($K$17,$F$8:$H$18,2,FALSE)","v":"2024-06-28"},{"$f":"VLOOKUP($K$17,$F$8:$H$18,3,FALSE)","v":"2024-07-19"}]
["６月",{"$f":"納税課用・修正シート!I8","v":"2024-07-01"},{"$f":"DBCS(IF(納税課用・修正シート!E8=\"\",\"\",納税課用・修正シート!E8))","v":"全期\n（第１期）"},{"$f":"DBCS(IF(納税課用・修正シート!F8=\"\",\"\",納税課用・修正シート!F8))","v":""},{"$f":"DBCS(IF(納税課用・修正シート!G8=\"\",\"\",納税課用・修正シート!G8))","v":""},{"$f":"DBCS(IF(納税課用・修正シート!H8=\"\",\"\",納税課用・修正シート!H8))","v":""},{"$f":"IF(納税課用・修正シート!J8>=$G$3,納税課用・修正シート!J8,③記入様式!$AR$74)","v":"2024-05-31"},{"$f":"IF(納税課用・修正シート!K8>=$G$3,納税課用・修正シート!K8,③記入様式!$AR$74)","v":"2024-06-19"},null,"第２期",{"$f":"VLOOKUP(J10,$C$8:$H$18,5,FALSE)","v":"2024-07-31"},{"$f":"VLOOKUP(J10,$C$8:$H$18,6,FALSE)","v":"2024-08-21"},{"$f":"VLOOKUP(J10,$D$8:$H$18,4,FALSE)","v":"2024-06-28"},{"$f":"VLOOKUP(J10,$D$8:$H$18,5,FALSE)","v":"2024-07-19"},null,null,{"$f":"VLOOKUP(J10,$F$8:$H$18,2,FALSE)","v":"2024-07-31"},{"$f":"VLOOKUP(J10,$F$8:$H$18,3,FALSE)","v":"2024-08-21"}]
["７月",{"$f":"納税課用・修正シート!I9","v":"2024-07-31"},{"$f":"DBCS(IF(納税課用・修正シート!E9=\"\",\"\",納税課用・修正シート!E9))","v":""},{"$f":"DBCS(IF(納税課用・修正シート!F9=\"\",\"\",納税課用・修正シート!F9))","v":"第２期"},{"$f":"DBCS(IF(納税課用・修正シート!G9=\"\",\"\",納税課用・修正シート!G9))","v":""},{"$f":"DBCS(IF(納税課用・修正シート!H9=\"\",\"\",納税課用・修正シート!H9))","v":"全期\n（第１期）"},{"$f":"IF(納税課用・修正シート!J9>=$G$3,納税課用・修正シート!J9,③記入様式!$AR$74)","v":"2024-06-28"},{"$f":"IF(納税課用・修正シート!K9>=$G$3,納税課用・修正シート!K9,③記入様式!$AR$74)","v":"2024-07-19"},null,"第３期",{"$f":"VLOOKUP(J11,$C$8:$H$18,5,FALSE)","v":"2024-09-30"},{"$f":"VLOOKUP(J11,$C$8:$H$18,6,FALSE)","v":"2024-10-21"},{"$f":"VLOOKUP(J11,$D$8:$H$18,4,FALSE)","v":"2024-11-25"},{"$f":"VLOOKUP(J11,$D$8:$H$18,5,FALSE)","v":"2024-12-13"},null,null,{"$f":"VLOOKUP(J11,$F$8:$H$18,2,FALSE)","v":"2024-08-30"},{"$f":"VLOOKUP(J11,$F$8:$H$18,3,FALSE)","v":"2024-09-17"}]
["８月",{"$f":"納税課用・修正シート!I10","v":"2024-09-02"},{"$f":"DBCS(IF(納税課用・修正シート!E10=\"\",\"\",納税課用・修正シート!E10))","v":"第２期"},{"$f":"DBCS(IF(納税課用・修正シート!F10=\"\",\"\",納税課用・修正シート!F10))","v":""},{"$f":"DBCS(IF(納税課用・修正シート!G10=\"\",\"\",納税課用・修正シート!G10))","v":""},{"$f":"DBCS(IF(納税課用・修正シート!H10=\"\",\"\",納税課用・修正シート!H10))","v":"第２期"},{"$f":"IF(納税課用・修正シート!J10>=$G$3,納税課用・修正シート!J10,③記入様式!$AR$74)","v":"2024-07-31"},{"$f":"IF(納税課用・修正シート!K10>=$G$3,納税課用・修正シート!K10,③記入様式!$AR$74)","v":"2024-08-21"},null,"第４期","2024-12-20","2025-01-21",{"$f":"VLOOKUP(J12,$D$8:$H$18,4,FALSE)","v":"2025-01-31"},{"$f":"VLOOKUP(J12,$D$8:$H$18,5,FALSE)","v":"2025-02-17"},null,null,"2024-09-30","2024-10-21"]
["９月",{"$f":"納税課用・修正シート!I11","v":"2024-09-30"},{"$f":"DBCS(IF(納税課用・修正シート!E11=\"\",\"\",納税課用・修正シート!E11))","v":""},{"$f":"DBCS(IF(納税課用・修正シート!F11=\"\",\"\",納税課用・修正シート!F11))","v":""},{"$f":"DBCS(IF(納税課用・修正シート!G11=\"\",\"\",納税課用・修正シート!G11))","v":""},{"$f":"DBCS(IF(納税課用・修正シート!H11=\"\",\"\",納税課用・修正シート!H11))","v":"第３期"},{"$f":"IF(納税課用・修正シート!J11>=$G$3,納税課用・修正シート!J11,③記入様式!$AR$74)","v":"2024-08-30"},{"$f":"IF(納税課用・修正シート!K11>=$G$3,納税課用・修正シート!K11,③記入様式!$AR$74)","v":"2024-09-17"},null,"第５期",null,null,null,null,null,null,"2024-10-31","2024-11-20"]
["１０月",{"$f":"納税課用・修正シート!I12","v":"2024-10-31"},{"$f":"DBCS(IF(納税課用・修正シート!E12=\"\",\"\",納税課用・修正シート!E12))","v":"第３期"},{"$f":"DBCS(IF(納税課用・修正シート!F12=\"\",\"\",納税課用・修正シート!F12))","v":""},{"$f":"DBCS(IF(納税課用・修正シート!G12=\"\",\"\",納税課用・修正シート!G12))","v":""},{"$f":"DBCS(IF(納税課用・修正シート!H12=\"\",\"\",納税課用・修正シート!H12))","v":"第４期"},{"$f":"IF(納税課用・修正シート!J12>=$G$3,納税課用・修正シート!J12,③記入様式!$AR$74)","v":"2024-09-30"},{"$f":"IF(納税課用・修正シート!K12>=$G$3,納税課用・修正シート!K12,③記入様式!$AR$74)","v":"2024-10-21"},null,"第６期",null,null,null,null,null,null,"2024-11-25","2024-12-13"]
["１１月",{"$f":"納税課用・修正シート!I13","v":"2024-12-02"},{"$f":"DBCS(IF(納税課用・修正シート!E13=\"\",\"\",納税課用・修正シート!E13))","v":""},{"$f":"DBCS(IF(納税課用・修正シート!F13=\"\",\"\",納税課用・修正シート!F13))","v":""},{"$f":"DBCS(IF(納税課用・修正シート!G13=\"\",\"\",納税課用・修正シート!G13))","v":""},{"$f":"DBCS(IF(納税課用・修正シート!H13=\"\",\"\",納税課用・修正シート!H13))","v":"第５期"},{"$f":"IF(納税課用・修正シート!J13>=$G$3,納税課用・修正シート!J13,③記入様式!$AR$74)","v":"2024-10-31"},{"$f":"IF(納税課用・修正シート!K13>=$G$3,納税課用・修正シート!K13,③記入様式!$AR$74)","v":"2024-11-20"},null,"第７期",null,null,null,null,null,null,"2024-12-20","2025-01-21"]
{"$rows_left_out":13}
{"sheet":"③記入様式","index":2,"n_rows":127,"n_cols":56,"rows_kept":127,"cut":false,"hidden":false,"merged":[[17,37,18,38],[17,34,17,36],[17,27,17,28],[17,30,17,31],[17,32,17,33],[18,27,18,28],[18,30,18,36],[20,27,20,28],[21,27,21,28],[20,30,20,31],[21,30,21,36],[20,34,20,36],[101,0,106,1],[33,29,33,33],[102,4,103,4],[102,5,103,5],[102,6,103,6],[102,7,103,7],[102,8,103,8],[89,0,92,1],[89,2,90,3],[91,2,92,3],[104,11,106,11],[102,2,103,2],[102,3,103,3],[29,0,34,1],[56,0,59,1],[96,2,98,3],[99,2,100,3],[99,4,100,19],[32,3,34,10],[95,2,95,3],[90,4,90,19],[20,22,20,25],[21,22,21,25],[20,32,20,33],[19,22,19,26],[19,27,19,37],[104,3,106,10],[104,2,106,2],[29,13,29,19],[29,2,29,5],[29,9,29,12],[30,2,31,2],[56,2,57,3],[58,4,59,19],[60,4,61,19],[30,3,31,3],[30,4,31,4],[30,5,31,5],[30,6,31,6],[30,8,31,8],[30,13,31,19],[30,9,31,12],[30,7,31,7],[96,4,98,19],[104,12,106,19],[68,2,68,5],[68,9,68,12],[68,13,68,19],[66,4,67,19],[63,4,65,19],[32,12,34,19],[69,9,70,12],[106,34,106,38],[95,4,95,19],[102,9,103,12],[100,22,100,26],[100,27,100,37],[72,34,72,38],[85,0,85,38],[87,0,87,15],[89,5,89,19],[93,0,100,1],[101,2,101,5],[101,9,101,12],[101,13,101,19],[102,13,103,19],[95,37,96,38],[94,22,94,26],[94,27,94,37],[97,22,97,26],[97,27,97,37],[98,22,98,25],[91,4,92,19],[93,4,94,19],[88,0,88,3],[13,0,13,38],[16,0,16,3],[21,0,28,1],[21,2,22,3],[21,17,21,19],[17,0,20,1],[17,2,18,3],[19,2,20,3],[23,2,23,3],[15,0,15,15],[19,4,20,19],[23,4,23,16],[21,4,22,16],[17,10,17,19],[22,27,22,37],[18,4,18,19],[17,5,17,9],[22,22,22,26],[23,22,23,25],[15,28,15,29],[15,30,15,31],[15,33,15,34],[15,36,15,37],[20,37,21,38],[60,0,67,1],[60,2,61,3],[55,0,55,3],[54,0,54,15],[33,34,33,38],[54,32,54,38],[58,22,58,26],[58,27,58,37],[71,2,73,2],[32,11,34,11],[32,2,34,2],[52,0,52,38],[58,2,59,3],[62,2,62,3],[62,4,62,19],[56,5,56,19],[57,4,57,19],[56,21,58,21],[56,27,56,28],[56,30,56,31],[56,34,56,36],[57,27,57,28],[66,2,67,3],[63,2,65,3],[95,22,95,25],[95,26,96,36],[96,22,96,25],[89,21,91,21],[92,21,94,21],[91,22,91,26],[89,27,89,28],[90,27,90,28],[89,30,89,31],[89,32,89,33],[92,30,92,31],[92,32,92,33],[92,34,92,36],[93,30,93,36],[92,22,92,25],[93,22,93,25],[92,27,92,28],[93,27,93,28],[25,27,25,37],[23,37,24,38],[26,22,26,25],[27,22,27,25],[26,27,26,28],[26,30,26,31],[26,34,26,36],[27,27,27,28],[27,30,27,36],[24,22,24,25],[27,4,28,19],[24,2,26,3],[24,4,26,16],[27,2,28,3],[22,17,26,19],[60,30,60,36],[56,37,57,38],[28,22,28,26],[28,27,28,37],[26,37,27,38],[31,21,32,38],[26,32,26,33],[59,21,61,21],[59,22,59,25],[61,22,61,26],[61,27,61,37],[59,32,59,33],[59,27,59,28],[60,27,60,28],[59,30,59,31],[59,34,59,36],[59,37,60,38],[23,26,24,36],[25,22,25,26],[17,21,18,21],[20,21,21,21],[65,21,67,21],[67,22,67,26],[67,27,67,37],[65,22,65,25],[66,22,66,25],[65,27,65,28],[66,27,66,28],[65,30,65,31],[66,30,66,36],[65,37,66,38],[65,34,65,36],[65,32,65,33],[62,22,62,25],[63,22,63,25],[62,26,63,36],[62,37,63,38],[62,21,64,21],[64,22,64,26],[64,27,64,37],[57,30,57,36],[56,32,56,33],[60,22,60,25],[92,37,93,38],[91,27,91,37],[68,21,69,38],[70,21,71,38],[72,29,72,33],[72,24,72,28],[77,0,77,38],[75,0,76,1],[71,11,73,11],[87,32,87,38],[75,2,76,17],[69,13,70,19],[79,0,81,1],[93,2,94,3],[68,0,73,1],[71,12,73,19],[71,3,73,10],[69,2,70,2],[69,3,70,3],[69,4,70,4],[69,5,70,5],[69,6,70,6],[69,7,70,7],[69,8,70,8],[29,21,30,38],[17,22,18,25],[56,22,57,25],[89,22,90,25],[107,0,108,19],[101,21,101,38],[102,21,102,38],[104,21,105,38],[106,29,106,33],[23,21,24,21],[26,21,27,21],[99,22,99,25],[95,21,97,21],[98,21,100,21],[98,27,98,28],[99,27,99,28],[98,30,98,31],[98,32,98,33],[98,34,98,36],[98,37,99,38],[99,30,99,36],[89,34,89,36],[89,37,90,38],[90,30,90,36]]}
[]
[]
[]
[]
[]
[]
[]
[]
[]
[]
[]
[]
[null,null,null,null,null,null,null,null,null,null,null,null,null,null,null,null,null,null,null,null,null,null,null,null,null,null,null,null,null,null,null,null,null,null,null,null,null,null,null,null,null,null,"AN列～CJ列は非表示に。"]
["たつの市市税等口座振替依頼書兼解約届書",null,null,null,null,null,null,null,null,null,null,null,null,null,null,null,null,null,null,null,null,null,null,null,null,null,null,null,null,null,null,null,null,null,null,null,null,null,null,null,null,null,null,"データ処理、変換用"]
[]
{"$rows_left_out":113}
{"sheet":"④印刷後の手引き","index":3,"n_rows":34,"n_cols":3,"rows_kept":34,"cut":false,"hidden":false,"merged":[[33,0,34,10],[9,2,10,10],[24,2,27,10],[29,2,31,10],[0,0,2,10]]}
["印刷後の手引き"]
[]
[]
[]
["書類を提出する前に、ご確認ください。"]
[]
[]
[]
[null,"１","お届け印を押印しましたか？"]
[null,null,"１／３枚目、金融機関用の依頼書兼解約届書の１か所のみ"]
[]
[]
[]
[]
[]
{"$rows_left_out":20}
{"sheet":"記入例","index":4,"n_rows":26,"n_cols":39,"rows_kept":26,"cut":false,"hidden":true,"merged":[[1,0,1,38],[3,0,3,15],[3,28,3,29],[3,30,3,31],[3,33,3,34],[3,36,3,37],[8,32,8,33],[9,30,9,36],[9,27,9,28],[4,0,4,3],[5,0,8,1],[5,2,6,3],[5,5,5,9],[5,10,5,19],[5,21,6,21],[6,4,6,19],[7,2,8,3],[7,4,8,19],[5,22,5,25],[7,22,7,26],[8,21,9,21],[8,22,8,25],[5,37,6,38],[6,22,6,25],[6,27,6,28],[10,22,10,26],[10,27,10,37],[9,22,9,25],[7,27,7,37],[8,34,8,36],[8,37,9,38],[6,30,6,36],[5,27,5,28],[5,30,5,31],[5,32,5,33],[5,34,5,36],[8,27,8,28],[8,30,8,31],[11,2,11,3],[9,0,16,1],[9,2,10,3],[9,4,10,16],[9,17,9,19],[11,4,11,16],[15,2,16,3],[12,2,14,3],[10,17,14,19],[11,21,12,21],[11,22,11,25],[11,26,12,36],[11,37,12,38],[12,4,14,16],[12,22,12,25],[13,22,13,26],[13,27,13,37],[14,37,15,38],[15,4,16,19],[15,22,15,25],[15,27,15,28],[15,30,15,36],[16,22,16,26],[16,27,16,37],[14,21,15,21],[14,22,14,25],[14,27,14,28],[14,30,14,31],[14,32,14,33],[14,34,14,36],[17,0,22,1],[17,2,17,5],[17,9,17,12],[17,13,17,19],[20,2,22,2],[17,21,17,38],[18,2,19,2],[18,3,19,3],[18,4,19,4],[18,5,19,5],[18,6,19,6],[21,34,21,38],[18,7,19,7],[18,8,19,8],[18,9,19,12],[18,13,19,19],[18,21,18,38],[19,21,20,38],[20,3,22,10],[20,11,22,11],[20,12,22,19],[21,29,21,33]]}
[]
["たつの市市税等口座振替依頼書兼解約届書"]
[]
[null,null,null,null,null,null,null,null,null,null,null,null,null,null,null,null,null,null,null,null,null,null,null,null,null,null,null,null,"令和",null,"○",null,"年","○",null,"月","○",null,"日"]
["申込区分",null,null,null,null,"☑","１　新規",null,null,"□","２　解約",null,null,null,null,null,null,null,null,null,null,null,null,null,null,null,null,null,null,null,null,null,null,null,null,null,null,"※最短で提出月の翌月末から振替を開始します。"]
["納税義務者",null,"住所",null,"〒","679-4192",null,null,null,null,null,null,null,null,null,null,null,null,null,null,null,"☑"," 市 ・ 県 民 税",null,null,null,"☑","令和",null,5,"年度",null,"第○期",null,"から期別"]
[null,null,null,null,"たつの市龍野町富永1005番地1",null,null,null,null,null,null,null,null,null,null,null,null,null,null,null,null,null,"（普通徴収分）",null,null,null,"□","令和",null,null,"年度から一括"]
[null,null,"氏名",null,"龍野　さくら",null,null,null,null,null,null,null,null,null,null,null,null,null,null,null,null,null,"通知書番号",null,null,null,null,123456789]
[null,null,null,null,null,null,null,null,null,null,null,null,null,null,null,null,null,null,null,null,null,"☑","固定資産税",null,null,null,"□","令和",null,null,"年度",null,null,null,"から期別"]
["口座名義人",null,"住所",null,"たつの市龍野町富永1005番地1",null,null,null,null,null,null,null,null,null,null,null,null,"お届け印",null,null,null,null,"都市計画税",null,null,null,"☑","令和",null,5,"年度から一括"]
[null,null,null,null,null,null,null,null,null,null,null,null,null,null,null,null,null,null,null,null,null,null,"通知書番号",null,null,null,null,123456789]
[null,null,"電話",null,"0791-64-3144",null,null,null,null,null,null,null,null,null,null,null,null,null,null,null,null,"☑"," 軽自動車税",null,null,null,"翌年度から納税義務者名義の\nすべての車両について適用"]
[null,null,"ﾌﾘｶﾞﾅ",null,"ﾀﾂﾉ ｻｸﾗ",null,null,null,null,null,null,null,null,null,null,null,null,null,null,null,null,null,"（種別割)"]
[null,null,null,null,null,null,null,null,null,null,null,null,null,null,null,null,null,null,null,null,null,null,"通知書番号",null,null,null,null,123456789]
[null,null,null,null,null,null,null,null,null,null,null,null,null,null,null,null,null,null,null,null,null,"☑"," 国民健康\n保険税",null,null,null,"☑","令和",null,5,"年度",null,"第○期",null,"から期別"]
{"$rows_left_out":12}
{"sheet":"取扱金融機関","index":5,"n_rows":537,"n_cols":42,"rows_kept":537,"cut":false,"hidden":true,"merged":[]}
["取扱金融機関名","コード","取扱金融機関コード",null,null,null,"三井住友銀行",null,null,"みなと銀行",null,null,"トマト銀行",null,null,"姫路信用金庫",null,null,"播州信用金庫",null,null,"兵庫信用金庫",null,null,"西兵庫信用金庫",null,null,"兵庫県医療信用組合",null,null,"兵庫県信用組合",null,null,"兵庫西農業協同組合",null,null,"なぎさ信用漁業協同連合会",null,null,"ゆうちょ銀行"]
["三井住友銀行","0009","コード1","コード2","コード3","コード4","支店名","支店名カナ","支店コード","支店名","支店名カナ","支店コード","支店名","支店名カナ","支店コード","支店名","支店名カナ","支店コード","支店名","支店名カナ","支店コード","支店名","支店名カナ","支店コード","支店名","支店名カナ","支店コード","支店名","支店名カナ","支店コード","支店名","支店名カナ","支店コード","支店名","支店名カナ","支店コード","支店名","支店名カナ","支店コード","支店名","支店名カナ","支店コード"]
["みなと銀行","0562",{"$f":"IF(③記入様式!$D$33=$A$2,LEFT($B$2,1),IF(③記入様式!$D$33=$A$3,LEFT($B$3,1),IF(③記入様式!$D$33=$A$4,LEFT($B$4,1),IF(③記入様式!$D$33=$A$5,LEFT($B$5,1),IF(③記入様式!$D$33=$A$6,LEFT($B$6,1),IF(③記入様式!$D$33=$A$7,LEFT($B$7,1),IF(③記入様式!$D$33=$A$8,LEFT($B$8,1),IF(③記入様式!$D$33=$A$9,LEFT($B$9,1),IF(③記入様式!$D$33=$A$10,LEFT($B$10,1),IF(③記入様式!$D$33=$A$11,LEFT($B$11,1),IF(③記入様式!$D$33=$A$12,LEFT($B$12,1),\"\")))))))))))","v":""},{"$f":"IF(③記入様式!$D$33=$A$2,MID($B$2,2,1),IF(③記入様式!$D$33=$A$3,MID($B$3,2,1),IF(③記入様式!$D$33=$A$4,MID($B$4,2,1),IF(③記入様式!$D$33=$A$5,MID($B$5,2,1),IF(③記入様式!$D$33=$A$6,MID($B$6,2,1),IF(③記入様式!$D$33=$A$7,MID($B$7,2,1),IF(③記入様式!$D$33=$A$8,MID($B$8,2,1),IF(③記入様式!$D$33=$A$9,MID($B$9,2,1),IF(③記入様式!$D$33=$A$10,MID($B$10,2,1),IF(③記入様式!$D$33=$A$11,MID($B$11,2,1),IF(③記入様式!$D$33=$A$12,MID($B$12,2,1),\"\")))))))))))","v":""},{"$f":"IF(③記入様式!$D$33=$A$2,MID($B$2,3,1),IF(③記入様式!$D$33=$A$3,MID($B$3,3,1),IF(③記入様式!$D$33=$A$4,MID($B$4,3,1),IF(③記入様式!$D$33=$A$5,MID($B$5,3,1),IF(③記入様式!$D$33=$A$6,MID($B$6,3,1),IF(③記入様式!$D$33=$A$7,MID($B$7,3,1),IF(③記入様式!$D$33=$A$8,MID($B$8,3,1),IF(③記入様式!$D$33=$A$9,MID($B$9,3,1),IF(③記入様式!$D$33=$A$10,MID($B$10,3,1),IF(③記入様式!$D$33=$A$11,MID($B$11,3,1),IF(③記入様式!$D$33=$A$12,MID($B$12,3,1),\"\")))))))))))","v":""},{"$f":"IF(③記入様式!$D$33=$A$2,MID($B$2,4,1),IF(③記入様式!$D$33=$A$3,MID($B$3,4,1),IF(③記入様式!$D$33=$A$4,MID($B$4,4,1),IF(③記入様式!$D$33=$A$5,MID($B$5,4,1),IF(③記入様式!$D$33=$A$6,MID($B$6,4,1),IF(③記入様式!$D$33=$A$7,MID($B$7,4,1),IF(③記入様式!$D$33=$A$8,MID($B$8,4,1),IF(③記入様式!$D$33=$A$9,MID($B$9,4,1),IF(③記入様式!$D$33=$A$10,MID($B$10,4,1),IF(③記入様式!$D$33=$A$11,MID($B$11,4,1),IF(③記入様式!$D$33=$A$12,MID($B$12,4,1),\"\")))))))))))","v":""},"龍野支店","タツノ","463","龍野支店","タツノ","346","龍野支店","タツノ","037","龍野支店","タツノシテン","009","龍野支店","ﾀﾂﾉ","045","御津支店","ﾐﾂ","012","新宮支店","ｼﾝｸﾞｳ","007","尼崎支店","ｱﾏｶﾞｻｷ","002","龍野支店","ﾀﾂﾉ",420,"揖西支店","ｲﾂｻｲ",333,"明石支店","ｱｶｼ","040","四三八","ﾖﾝｻﾝﾊﾁ",438]
["トマト銀行","0566",null,null,null,null,"ＳＭＢＣ日興証券支店","ＳＭＢＣニツコウシヨウケン","928","相生支店","アイオイ","465","青江支店","アオエ","050","相生支店","アイオイシテン","013","相生支店","ｱｲｵｲ","017","新宮支店","ｼﾝｸﾞｳ","043","龍野支店","ﾀﾂﾉ","018","西宮支店","ﾆｼﾉﾐﾔ","004","新宮支店","ｼﾝｸﾞｳ",430,"揖保支店","ｲﾎﾞ",335,"有田支店","ｱﾘﾀﾞ",520,"〇〇八","ｾﾞﾛｾﾞﾛﾊﾁ","008"]
["姫路信用金庫","1685","支店コード",null,null,null,"アオイ支店","アオイ","969","明石支店","アカシ","084","赤磐支店","アカイワ","077","青山支店","アオヤマシテン","022","青山支店","ｱｵﾔﾏ","046","相生支店","ｱｲｵｲ","022","相生支店","ｱｲｵｲ","019","姫路支店","ﾋﾒｼﾞ","003","朝来支店","ｱｻｺﾞ",610,"揖保川支店","ｲﾎﾞｶﾞﾜ",325,"淡路島支店","ｱﾜｼﾞｼﾏ",420,"〇一八","ｾﾞﾛｲﾁﾊﾁ","018"]
["播州信用金庫","1686","コード1","コード2","コード3",null,"青葉台支店","アオバダイ","579","赤穂支店","アコウ","466","赤穂支店","アコウ","036","明石支店","アカシシテン","015","明石支店","ｱｶｼ","025","赤穂支店","ｱｺｳ","016","網干支店","ｱﾎﾞｼ","027","本店営業部","ﾎﾝﾃﾝ","001","尼崎支店","ｱﾏｶﾞｻｷ",110,"神岡支店","ｶﾐｵｶ",336,"串本支店","ｸｼﾓﾄ",540,"〇一九","ｾﾞﾛｲﾁｷﾕｳ","019"]
["兵庫信用金庫","1687",{"$f":"LEFT($D$11,1)","v":{"$error":"#N/A"}},{"$f":"MID(D11,2,1)","v":{"$error":"#N/A"}},{"$f":"MID(D11,3,1)","v":{"$error":"#N/A"}},null,"青山支店","アオヤマ","258","朝霧支店","アサギリ","077","井原支店","イバラ","031","赤穂支店","アコウシテン","026","英賀保支店","ｱｶﾞﾎ","032","網干支店","ｱﾎﾞｼ","006","一宮支店","ｲﾁﾉﾐﾔ","005",null,null,null,"有野支店","ｱﾘﾉ","050","新宮支店","ｼﾝｸﾞｳ",311,"神戸支店","ｺｳﾍﾞ","020","〇二八","ｾﾞﾛﾆﾊﾁ","028"]
["西兵庫信用金庫","1694","引用",{"$f":"VLOOKUP(③記入様式!D33,取扱金融機関!$A$2:$A$13,1,0)","v":{"$error":"#N/A"}},null,null,"赤池支店","アカイケ","738","芦屋駅前支店","アシヤエキマエ","158","大阪支店","オオサカ","045","網干支店","アボシシテン","042","赤穂支店","ｱｺｳ","039","網干駅支店","ｱﾎﾞｼｴｷ","008","上野支店","ｳｴﾉ","003",null,null,null,"稲美支店","ｲﾅﾐ",220,"龍野誉田支店","ﾀﾂﾉﾎﾝﾀﾞ",331,"御坊支店","ｺﾞﾎﾞｳ",530,"〇二九","ｾﾞﾛﾆｷﾕｳ","029"]
["兵庫県医療信用組合","2605","変換",{"$f":"\"[all]\"&$D$8","v":{"$error":"#N/A"}},null,null,"赤川町支店","アカガワチヨウ","138","網干支店","アボシ","345","岡山駅前支店","オカヤマエキマエ","052","インターネット支店","インターネットシテン","070","網干支店","ｱﾎﾞｼ","020","家島支店","ｲｴｼﾏ","014","大津支店","ｵｵﾂ","023",null,null,null,"大橋支店","ｵｵﾊｼ","040","御津支店","ﾐﾂ",328,"但馬支店","ﾀｼﾞﾏ",180,"〇三八","ｾﾞﾛｻﾝﾊﾁ","038"]
["兵庫県信用組合","2606","引用",{"$f":"VLOOKUP(③記入様式!$M$33,INDIRECT(③記入様式!$D$33),1,FALSE)","v":{"$error":"#REF!"}},null,null,"赤坂支店","アカサカ","825","網干駅支店","アボシエキ","459","岡山県庁支店","オカヤマケンチヨウ","066","駅南支店","エキナンシテン","055","尼崎支店","ｱﾏｶﾞｻｷ","068","今宿支店","ｲﾏｼﾞﾕｸ","023","加古川支店","ｶｺｶﾞﾜ","015",null,null,null,"小野支店","ｵﾉ",310,"英賀保支店","ｱｶﾞﾎ",171,"坊勢支店","ﾎﾞｳｾﾞ",100,"〇三九","ｾﾞﾛｻﾝｷﾕｳ","039"]
["兵庫西農業協同組合","7288","コード",{"$f":"IF($D$8=A13,\"\",VLOOKUP($D$10,INDIRECT(D9),3,FALSE))","v":{"$error":"#N/A"}},null,null,"明石支店","アカシ","425","尼崎支店","アマガサキ","051","岡山南支店","オカヤマミナミ","040","駅前支店","エキマエシテン","004","荒井支店","ｱﾗｲ","048","大久保支店","ｵｵｸﾎﾞ","026","加古川北支店","ｶｺｶﾞﾜｷﾀ","017",null,null,null,"柏原支店","ｶｲﾊﾞﾗ",530,"赤穂支店","ｱｺｳ",411,"本店","ﾎﾝﾃﾝ","001","〇四八","ｾﾞﾛﾖﾝﾊﾁ","048"]
["なぎさ信用漁業協同連合会","9477","#N/Aのとき","-","と表示",null,"赤羽支店","アカバネ","226","家島支店","イエシマ","347","岡山流通センター支店","オカヤマリユウツウセンタ－","065","大久保支店","オオクボシテン","047","伊丹支店","ｲﾀﾐ","073","御旅支店","ｵﾀﾋﾞ","030","勝原支店","ｶﾂﾊﾗ","013",null,null,null,"加古川支店","ｶｺｶﾞﾜ",210,"網干支店","ｱﾎﾞｼ",166,"和歌山支店","ﾜｶﾔﾏ",510,"〇四九","ｾﾞﾛﾖﾝｷﾕｳ","049"]
["ゆうちょ銀行",null,null,null,null,null,"昭島支店","アキシマ","678","伊川谷支店","イカワダニ","197","笠岡支店","カサオカ","030","大津支店","オオツシテン","024","市場支店","ｲﾁﾊﾞ","016","加古川支店","ｶｺｶﾞﾜ","041","京口支店","ｷﾖｳｸﾞﾁ","014",null,null,null,"加西支店","ｶｻｲ",370,"荒川支店","ｱﾗｶﾜ",116,null,null,null,"〇五八","ｾﾞﾛｺﾞﾊﾁ","058"]
[null,null,null,null,null,null,"あさがお支店","アサガオ","963","伊丹支店","イタミ","056","片上支店","カタカミ","009","尾上支店","オノウエシテン","021","稲美支店","ｲﾅﾐ","058","上郡支店","ｶﾐｺﾞｵﾘ","015","佐用支店","ｻﾖｳ","024",null,null,null,"篠山支店","ｻｻﾔﾏ",520,"粟賀支店","ｱﾜｶﾞ",211,null,null,null,"〇五九","ｾﾞﾛｺﾞｷﾕｳ","059"]
[null,null,null,null,null,null,"阿佐ケ谷支店","アサガヤ","792","板宿支店","イタヤド","019","賀陽支店","カヨウ","021","小野支店","オノシテン","027","伊保支店","ｲﾎ","034","甲子園支店","ｺｳｼｴﾝ","035","飾磨支店","ｼｶﾏ","021",null,null,null,"三田支店","ｻﾝﾀﾞ",510,"市川支店","ｲﾁｶﾜ",216,null,null,null,"〇六八","ｾﾞﾛﾛｸﾊﾁ","068"]
{"$rows_left_out":523}
{"sheet":"納税課用・修正シート","index":6,"n_rows":16,"n_cols":12,"rows_kept":16,"cut":false,"hidden":true,"merged":[[4,1,15,1],[4,2,15,2],[4,0,15,0]]}
["水色に塗りつぶされたセルのみ更新してください。"]
[]
["No.","項目","修正すべき内容","修正欄"]
[1,"振替（払込）希望税目","年度",6,"←今年度"]
[2,"申込受付締切","納税カレンダー","月","市・県民税\n(普通徴収分)","固定資産税\n都市計画税","軽自動車税","国民健康保険税\n（普通徴収分）","納期限\n(口座振替日)","用紙申込締切","ペイジー申込締切"]
[null,null,null,"4月",null,null,"全期",null,"2024-04-30","2024-03-29","2024-04-17","←以下、「納税カレンダー」から転記"]
[null,null,null,"5月",null,"全期\n（第１期）",null,null,"2024-05-31","2024-04-30","2024-05-21"]
[null,null,null,"6月","全期\n（第１期）",null,null,null,"2024-07-01","2024-05-31","2024-06-19"]
[null,null,null,"7月",null,"第２期",null,"全期\n（第１期）","2024-07-31","2024-06-28","2024-07-19"]
[null,null,null,"8月","第２期",null,null,"第２期","2024-09-02","2024-07-31","2024-08-21"]
[null,null,null,"9月",null,null,null,"第３期","2024-09-30","2024-08-30","2024-09-17"]
[null,null,null,"10月","第３期",null,null,"第４期","2024-10-31","2024-09-30","2024-10-21"]
[null,null,null,"11月",null,null,null,"第５期","2024-12-02","2024-10-31","2024-11-20"]
[null,null,null,"12月",null,"第３期",null,"第６期","2024-12-25","2024-11-25","2024-12-13"]
[null,null,null,"1月","第４期",null,null,"第７期","2025-01-31","2024-12-20","2025-01-21"]
{"$rows_left_out":1}